TEST-REVOKE test errors on --now and --publish.

7 jobs for 89_revoke in 1 minute and 58 seconds (queued for 6 seconds)
latest
Status Job ID Name Coverage
  Checks
passed #55484
build

00:00:25

passed #55485
format

00:00:24

passed #55486
isort

00:00:23

 
  Tests
failed #55487
mille
tests-3.6

00:01:31

failed #55488
mille
tests-3.7-coverage

00:01:32

failed #55489
redshift
tests-3.8

00:01:27

failed #55490
redshift
tests-3.9

00:01:26

 
Name Stage Failure
failed
tests-3.7-coverage Tests
---------- coverage: platform linux, python 3.7.10-final-0 -----------
Coverage HTML written to dir cov_html

=========================== short test summary info ============================
FAILED tests/test_revoke.py::test_revoke_cli_dry_run[-v-False] - AssertionErr...
FAILED tests/test_revoke.py::test_revoke_cli_dry_run[-p-True] - AssertionErro...
================== 2 failed, 233 passed, 1 warning in 20.23s ===================
Cleaning up file based variables
ERROR: Job failed: exit code 1
failed
tests-3.6 Tests
    click.secho("/!\WARNING/!\\", blink=True, fg="red")

-- Docs: https://docs.pytest.org/en/stable/warnings.html
=========================== short test summary info ============================
FAILED tests/test_revoke.py::test_revoke_cli_dry_run[-v-False] - AssertionErr...
FAILED tests/test_revoke.py::test_revoke_cli_dry_run[-p-True] - AssertionErro...
================== 2 failed, 233 passed, 1 warning in 16.73s ===================
Cleaning up file based variables
ERROR: Job failed: exit code 1
failed
tests-3.8 Tests
  File "/usr/local/lib/python3.8/asyncio/selector_events.py", line 723, in _force_close
self._loop.call_soon(self._call_connection_lost, exc)
File "/usr/local/lib/python3.8/asyncio/base_events.py", line 719, in call_soon
self._check_closed()
File "/usr/local/lib/python3.8/asyncio/base_events.py", line 508, in _check_closed
raise RuntimeError('Event loop is closed')
RuntimeError: Event loop is closed
Cleaning up file based variables
ERROR: Job failed: exit code 1
failed
tests-3.9 Tests
    response = await client(process, transaction.signed_raw())

-- Docs: https://docs.pytest.org/en/stable/warnings.html
=========================== short test summary info ============================
FAILED tests/test_revoke.py::test_revoke_cli_dry_run[-v-False] - AssertionErr...
FAILED tests/test_revoke.py::test_revoke_cli_dry_run[-p-True] - AssertionErro...
================== 2 failed, 233 passed, 9 warnings in 15.16s ==================
Cleaning up file based variables
ERROR: Job failed: exit code 1